{"text_format":"1","workbook":"xlsx","n_sheets":10,"sheets":["READ FIRST","General Instructions","Form Instructions","Primary Information","Detailed Budget","Sum by Act","Sum by Cat","Qtr Breakdown","Custom Report","Validation Lists"],"not_rendered":{"charts":0,"images":0,"macros":1,"external_links":1,"defined_names":73,"comments":0,"pivot_tables":9},"unopened":[],"bounds":{"document_bytes":16777216,"sheet_cells":100000,"rows_first":2000,"rows_last":500,"rows_between":2000,"halvings":0,"cell_chars":16384,"cell_head_chars":4096},"cells_cut":0,"cells_raw":0,"read":"whole","date_system":"1900"}

{"sheet":"READ FIRST","index":0,"n_rows":9,"n_cols":2,"rows_kept":9,"cut":false,"hidden":false,"merged":[]}
["Please read this first"]
[]
[null,"Before you start, please read the general and form instruction sheets thoroughly. This will save considerable time and will ensure that the budget is accurate and complete. "]
[]
[null,"This budget template has been developed using Microsoft Excel 2007 and will not work properly with older versions.  Budgets must therefore be submitted using the MS 2007 or newer Excel versions.  Please note that the budget template in MS Excel for Windows does not work with the MAC environment. "]
[]
[null,"The template is protected in various ways to ensure that the reports, formats and features remain constant for all involved, and in particular for the external reviewers.  Any attempt to unprotect and modify the template will result in the proposed budget being rejected.  "]
[]
[null,"Activating the macro commands is required in order for the protected pivot table summary reports to refresh automatically and for this workbook to function properly. Your Excel settings can be set to do this automatically when opening the spreadsheet, (under the Office Button menus / Excel Options / Trust Center / Trust Center Settings / Macro Settings / and selecting \"Enable ... \"). \n\nTo effectively use the \"Custom Report\" tab, please ensure you refresh the data by choosing Pivottable Tools Menu / Analyze / Refresh once you have designed the custom reports you wish to use."]

{"sheet":"General Instructions","index":1,"n_rows":41,"n_cols":2,"rows_kept":41,"cut":false,"hidden":false,"merged":[[0,0,0,1]]}
["General Instructions"]
[]
[null,"These instructions should be read in conjunction with the Genome Canada Guidelines for Funding and the Request for Applications (RFA) for each competition. If there are any discrepancies between these documents and the instructions below, the provisions in the guidelines and RFA will prevail. "]
[]
[null,"EXPENSE CATEGORY "]
[null,"Salaries (SAL)"]
[null,"Genome Canada will accept actual benefit rates as charged by the host institution. Eligible benefits only include: payroll taxes, group insurance, and group pension. For institutional benefit rates higher than 20% of the employee’s salary, supporting documentation (such as a letter from the institutional human resources department that includes a breakdown of benefit rates) must be provided. Genome Canada will accept annual inflation for salary expenditures in the second and later years of the project at actual rates as charged by the host institution; for inflationary increases exceeding 1.5% of total salary and benefits, supporting documentation must be provided."]
[]
[]
[null,"Consumables (CONS)"]
[null,"Material and supplies: includes items that meet at least one of the following conditions: 1) expendable tangible property; or, 2) useful life of 1 year or less; or, 3) a cost of less than $2,000. As an example, a laptop computer that costs less than $2,000 would be considered a consumable even though it is a nonexpendable tangible item with a useful life of more than one year. For consumables commonly utilized in most laboratories, a general rate per FTE will be accepted, provided that the rate is appropriately justified in the supporting documentation. The consumables category also includes items such as equipment maintenance contracts and general maintenance of research infrastructure and travel that is directly related to the conduct of the project."]
[null,"Expenses related to the translation of results to applications (e.g., patent registration and filing costs, costs associated with advancing the development of products and technology to the proof of concept stage, market research and business case development, unless otherwise specified)."]
[]
[]
[null,"Services from Others (S&T)"]
{"$rows_left_out":27}
{"sheet":"Form Instructions","index":2,"n_rows":39,"n_cols":2,"rows_kept":39,"cut":false,"hidden":false,"merged":[[0,0,0,1]]}
["Form Instructions"]
[]
[null,"Completing the Budget Form"]
[null,"Throughout the “Primary Information” and “Detailed Budget” sheets, only enter information into the non-shaded / white cells. Cells that are blue are protected and do not need to be filled in or will fill in automatically.  Non-shaded / white cells outside of the reports area are protected as well.  Also, other sheets cannot be added within the budget template, so that the presentation layout is consistent with all proposed budgets. "]
[]
[null,"The level of detail in the budget should be somewhat proportionate to the total amount of funding, and to the research complexity, (e.g., the number of activities, sites, organizations or regions involved, the number of funders, etc.). For example, a smaller project with only a few activities may have less than 35 detail budget lines, while a much larger and very complex project may have over 75 detail budget lines.   "]
[]
[null,"First, the Primary Information "]
[null,"The “Primary Information” sheet must be completed first prior to entering information into the “Detailed budget” sheet, since the primary information is linked to other worksheets.   "]
[]
[null,"There are a maximum of 12 activities, including project management and GE³LS that \"must\" be identified as discrete activities, unless otherwise indicated in the guidelines for each competition. In addition, activities related to the socio-economic benefits should also be a discrete activity, where appropriate.  Less substantives activities are to be grouped under \"Other Activities\". For each Organization, a location from the drop down menu must be assigned.  "]
[]
[null,"The number of funders that can be identified is restricted to a maximum of 20. Less material funders are to be grouped under \"Other Minor Funders\" and all unknown funders are to be grouped under \"To Be Determined\". For each funder, the nature of funding from the drop down menu must be assigned."]
[]
[null,"Detailed Budget"]
{"$rows_left_out":25}
{"sheet":"Primary Information","index":3,"n_rows":79,"n_cols":6,"rows_kept":79,"cut":false,"hidden":false,"merged":[[45,2,45,3],[78,2,78,3],[63,2,63,3],[64,2,64,3],[65,2,65,3],[66,2,66,3],[67,2,67,3],[69,2,69,3],[70,2,70,3],[71,2,71,3],[72,2,72,3],[73,2,73,3],[74,2,74,3],[75,2,75,3],[76,2,76,3],[77,2,77,3],[40,2,40,3],[41,2,41,3],[42,2,42,3],[43,2,43,3],[44,2,44,3],[35,2,35,3],[36,2,36,3],[37,2,37,3],[38,2,38,3],[39,2,39,3],[46,2,46,3],[47,2,47,3],[48,2,48,3],[49,2,49,3],[50,2,50,3],[51,2,51,3],[52,2,52,3],[53,2,53,3],[68,2,68,3],[62,2,62,3],[54,2,54,3],[59,2,59,3],[60,2,60,3],[61,2,61,3],[24,2,24,5],[30,2,30,5],[2,0,3,5],[29,2,29,5],[25,2,25,5],[26,2,26,5],[27,2,27,5],[28,2,28,5],[17,2,17,4],[7,3,7,5],[8,3,8,5],[9,3,9,5],[10,3,10,5],[11,3,11,5],[12,3,12,5],[13,3,13,5],[23,2,23,5],[18,2,18,5],[19,2,19,5],[20,2,20,5],[21,2,21,5],[22,2,22,5]]}
["Primary Information"]
[]
["The user must complete each of the following sections before completing the \"Detailed Budget\" since the details are linked to the primary information."]
[]
[]
["General Information"]
[]
[null,null,"Genome Centre"]
[null,null,"Type","Research Project"]
[null,null,"Project Leader(s)","Leader Name"]
[null,null,"Project Title","Project Title"]
[null,null,"Start Date","2018 Oct-Dec"]
[null,null,"Program Name","2017 B/CB Competition"]
[null,null," Budget Version Date","2017-11-01"]
[]
{"$rows_left_out":65}
{"sheet":"Detailed Budget","index":4,"n_rows":515,"n_cols":72,"rows_kept":515,"cut":false,"hidden":false,"merged":[[10,9,10,34],[4,5,4,6]]}
["Detailed Budget",null,null,null,null,null,null,null,null,null,null,null,null,null,null,null,null,null,null,null,null,null,null,null,null,null,null,null,null,null,null,null,null,null,null,null,null,null,null,null,null,null,null,null,null,null,null,null,null,null,null,null,null,null,null,null,null,null,null,null,null,null,{"$f":"A1","v":"Detailed Budget"}]
[]
["Project Leader(s)",null,null,null,null,null,{"$f":"'Primary Information'!D10:D10","v":"Leader Name"},null,null,null,null,null,null,null,null,null,null,null,null,null,null,null,null,null,null,null,null,null,null,null,null,null,null,null,null,null,null,null,null,null,null,null,null,null,null,null,null,null,null,null,null,null,null,null,null,null,null,null,null,null,null,null,{"$f":"A3","v":"Project Leader(s)"},{"$f":"G3","v":"Leader Name"}]
["Project Title",null,null,null,null,null,{"$f":"'Primary Information'!D11:D11","v":"Project Title"},null,null,null,null,null,null,null,null,null,null,null,null,null,null,null,null,null,null,null,null,null,null,null,null,null,null,null,null,null,null,null,null,null,null,null,null,null,null,null,null,null,null,null,null,null,null,null,null,null,null,null,null,null,null,null,"Project Title",{"$f":"G4","v":"Project Title"}]
["Total Budget",null,null,null,null,{"$f":"BI13","v":0},null,null,null,null,null,null,null,null,null,null,null,null,null,null,null,null,null,null,null,null,null,null,null,null,null,null,null,null,null,null,null,null,null,null,null,null,null,null,null,null,null,null,null,null,null,null,null,null,null,null,null,null,null,null,null,null,"Total Budget",{"$f":"F5","v":0}]
["G&A Ratio",null,null,null,null,null,{"$f":"IF((BI13-SUMIF(D16:D515,\"G&A\",BI16:BI515))=0, \"-\",SUMIF(D16:D515,\"G&A\",BI16:BI515)/(BI13-SUMIF(D16:D515,\"G&A\",BI16:BI515)))","v":"-"},null,null,null,null,null,null,null,null,null,null,null,null,null,null,null,null,null,null,null,null,null,null,null,null,null,null,null,null,null,null,null,null,null,null,null,null,null,null,null,null,null,null,null,null,null,null,null,null,null,null,null,null,null,null,null,"G&A Ratio",{"$f":"G6","v":"-"}]
["Genome Canada Funding Ratio",null,null,null,null,null,{"$f":"IF(BI13=0,\"-\",SUMIF(BO16:BO515,'Primary Information'!$C$60,BI16:BI515)/(BI13))","v":"-"},null,null,null,null,null,null,null,null,null,null,null,null,null,null,null,null,null,null,null,null,null,null,null,null,null,null,null,null,null,null,null,null,null,null,null,null,null,null,null,null,null,null,null,null,null,null,null,null,null,null,null,null,null,null,null,"Genome Canada Funding Ratio",{"$f":"G7","v":"-"}]
["Lead Centre / Prov. Funding Ratio",null,null,null,null,null,{"$f":"IF(BI13=0,\"-\",SUMIF(BO16:BO515,'Primary Information'!$C$61,BI16:BI515)/(BI13))","v":"-"},null,null,null,null,null,null,null,null,null,null,null,null,null,null,null,null,null,null,null,null,null,null,null,null,null,null,null,null,null,null,null,null,null,null,null,null,null,null,null,null,null,null,null,null,null,null,null,null,null,null,null,null,null,null,null,"Lead Centre / Prov. Funding Ratio",{"$f":"G8","v":"-"}]
["Inflation Rate (applicable to salaries)",null,null,null,null,null,{"$f":"INFRATE","v":1.4999999999999999E-2},null,null,null,null,null,null,null,null,null,null,null,null,null,null,null,null,null,null,null,null,null,null,null,null,null,null,null,null,null,null,null,null,null,null,null,null,null,null,null,null,null,null,null,null,null,null,null,null,null,null,null,null,null,null,null,"Inflation Rate (applicable to salaries)",{"$f":"G9","v":1.4999999999999999E-2}]
[null,null,null,null,null,null,null,null,null,null,null,null,null,null,"Hidden","Hidden","Hidden","Hidden",null,"Hidden","Hidden","Hidden","Hidden",null,"Hidden","Hidden","Hidden","Hidden",null,"Hidden","Hidden","Hidden","Hidden"]
[null,null,"Hidden",null,"Hidden",null,null,null,null,"Full Time Equivalents or Units",null,null,null,null,null,null,null,null,null,null,null,null,null,null,null,null,null,null,null,null,null,null,null,null,null,null,null,null,null,null,"Hidden","Hidden","Hidden","Hidden",null,"Hidden","Hidden","Hidden","Hidden",null,"Hidden","Hidden","Hidden","Hidden",null,"Hidden","Hidden","Hidden","Hidden",null,null,null,null,null,null,null,null,null,null,"Hidden",null,"Hidden"]
["Ref.\n#","Act.\n#","Act.","Exp.\ncat.","Cat.","Description","Annual salary / Cost per unit","Ben.\nrate","Salary\n& ben.","Q1\n(units)","Q2\n(units)","Q3\n(units)","Q4\n(units)","YR1\n(units)","Q5\n(units)","Q6\n(units)","Q7\n(units)","Q8\n(units)","YR2\n(units)","Q9\n(units)","Q10\n(units)","Q11\n(units)","Q12\n(units)","YR3\n(units)","Q13\n(units)","Q14\n(units)","Q15\n(units)","Q16\n(units)","YR4\n(units)","Q17\n(units)","Q18\n(units)","Q19\n(units)","Q20\n(units)","YR5\n(units)","TOTAL\n(FTEs / units)","Q1\n($)","Q2\n($)","Q3\n($)","Q4\n($)","YR1\n($)","Q5\n($)","Q6\n($)","Q7\n($)","Q8\n($)","YR2\n($)","Q9\n($)","Q10\n($)","Q11\n($)","Q12\n($)","YR3\n($)","Q13\n($)","Q14\n($)","Q15\n($)","Q16\n($)","YR4\n($)","Q17\n($)","Q18\n($)","Q19\n($)","Q20\n($)","YR5\n($)","TOTAL\n($)","Ref #","Activity","Expense Category","Description","Justification","Source of funds","Organization\nincurring cost","Location / Technology Platform and Other Services","Source / Nature of funds","Filter\nfield","STINNC or LOCATIONS"]
[null,null,null,null,null,null,null,null,"PROJECT TOTAL",null,null,null,null,null,null,null,null,null,null,null,null,null,null,null,null,null,null,null,null,null,null,null,null,null,null,{"$f":"SUM(AJ16:AJ515)","v":0},0,0,0,0,0,0,0,0,0,0,0,0,0,0,0,0,0,0,0,0,0,0,0,0,0]
[null,null,null,null,null,null,null,null,"FILTER TOTAL (yellow = in use)",{"$f":"IF(SalOnly=0,SUBTOTAL(9,J16:J515),IF(SalOnly=SUBTOTAL(9,$AI$16:$AI$515),SUBTOTAL(9,$J$16:$J$515),\"N/A\"))","v":0},{"$f":"IF(SalOnly=0,SUBTOTAL(9,K16:K515),IF(SalOnly=SUBTOTAL(9,$AI$16:$AI$515),SUBTOTAL(9,$K$16:$K$515),\"N/A\"))","v":0},{"$f":"IF(SalOnly=0,SUBTOTAL(9,L16:L515),IF(SalOnly=SUBTOTAL(9,$AI$16:$AI$515),SUBTOTAL(9,$L$16:$L$515),\"N/A\"))","v":0},{"$f":"IF(SalOnly=0,SUBTOTAL(9,M16:M515),IF(SalOnly=SUBTOTAL(9,$AI$16:$AI$515),SUBTOTAL(9,$M$16:$M$515),\"N/A\"))","v":0},{"$f":"IF(SalOnly=0,SUBTOTAL(9,N16:N515),IF(SalOnly=SUBTOTAL(9,$AI$16:$AI$515),SUBTOTAL(9,$N$16:$N$515),\"N/A\"))","v":0},{"$f":"IF(SalOnly=0,SUBTOTAL(9,O16:O515),IF(SalOnly=SUBTOTAL(9,$AI$16:$AI$515),SUBTOTAL(9,$O$16:$O$515),\"N/A\"))","v":0},{"$f":"IF(SalOnly=0,SUBTOTAL(9,P16:P515),IF(SalOnly=SUBTOTAL(9,$AI$16:$AI$515),SUBTOTAL(9,$P$16:$P$515),\"N/A\"))","v":0},{"$f":"IF(SalOnly=0,SUBTOTAL(9,Q16:Q515),IF(SalOnly=SUBTOTAL(9,$AI$16:$AI$515),SUBTOTAL(9,$Q$16:$Q$515),\"N/A\"))","v":0},{"$f":"IF(SalOnly=0,SUBTOTAL(9,R16:R515),IF(SalOnly=SUBTOTAL(9,$AI$16:$AI$515),SUBTOTAL(9,$R$16:$R$515),\"N/A\"))","v":0},{"$f":"IF(SalOnly=0,SUBTOTAL(9,S16:S515),IF(SalOnly=SUBTOTAL(9,$AI$16:$AI$515),SUBTOTAL(9,$S$16:$S$515),\"N/A\"))","v":0},{"$f":"IF(SalOnly=0,SUBTOTAL(9,T16:T515),IF(SalOnly=SUBTOTAL(9,$AI$16:$AI$515),SUBTOTAL(9,$T$16:$T$515),\"N/A\"))","v":0},{"$f":"IF(SalOnly=0,SUBTOTAL(9,U16:U515),IF(SalOnly=SUBTOTAL(9,$AI$16:$AI$515),SUBTOTAL(9,$U$16:$U$515),\"N/A\"))","v":0},{"$f":"IF(SalOnly=0,SUBTOTAL(9,V16:V515),IF(SalOnly=SUBTOTAL(9,$AI$16:$AI$515),SUBTOTAL(9,$V$16:$V$515),\"N/A\"))","v":0},{"$f":"IF(SalOnly=0,SUBTOTAL(9,W16:W515),IF(SalOnly=SUBTOTAL(9,$AI$16:$AI$515),SUBTOTAL(9,$W$16:$W$515),\"N/A\"))","v":0},{"$f":"IF(SalOnly=0,SUBTOTAL(9,X16:X515),IF(SalOnly=SUBTOTAL(9,$AI$16:$AI$515),SUBTOTAL(9,$X$16:$X$515),\"N/A\"))","v":0},{"$f":"IF(SalOnly=0,SUBTOTAL(9,Y16:Y515),IF(SalOnly=SUBTOTAL(9,$AI$16:$AI$515),SUBTOTAL(9,$Y$16:$Y$515),\"N/A\"))","v":0},{"$f":"IF(SalOnly=0,SUBTOTAL(9,Z16:Z515),IF(SalOnly=SUBTOTAL(9,$AI$16:$AI$515),SUBTOTAL(9,$Z$16:$Z$515),\"N/A\"))","v":0},{"$f":"IF(SalOnly=0,SUBTOTAL(9,AA16:AA515),IF(SalOnly=SUBTOTAL(9,$AI$16:$AI$515),SUBTOTAL(9,$AA$16:$AA$515),\"N/A\"))","v":0},{"$f":"IF(SalOnly=0,SUBTOTAL(9,AB16:AB515),IF(SalOnly=SUBTOTAL(9,$AI$16:$AI$515),SUBTOTAL(9,$AB$16:$AB$515),\"N/A\"))","v":0},{"$f":"IF(SalOnly=0,SUBTOTAL(9,AC16:AC515),IF(SalOnly=SUBTOTAL(9,$AI$16:$AI$515),SUBTOTAL(9,$AC$16:$AC$515),\"N/A\"))","v":0},{"$f":"IF(SalOnly=0,SUBTOTAL(9,AD16:AD515),IF(SalOnly=SUBTOTAL(9,$AI$16:$AI$515),SUBTOTAL(9,$AD$16:$AD$515),\"N/A\"))","v":0},{"$f":"IF(SalOnly=0,SUBTOTAL(9,AE16:AE515),IF(SalOnly=SUBTOTAL(9,$AI$16:$AI$515),SUBTOTAL(9,$AE$16:$AE$515),\"N/A\"))","v":0},{"$f":"IF(SalOnly=0,SUBTOTAL(9,AF16:AF515),IF(SalOnly=SUBTOTAL(9,$AI$16:$AI$515),SUBTOTAL(9,$AF$16:$AF$515),\"N/A\"))","v":0},{"$f":"IF(SalOnly=0,SUBTOTAL(9,AG16:AG515),IF(SalOnly=SUBTOTAL(9,$AI$16:$AI$515),SUBTOTAL(9,$AG$16:$AG$515),\"N/A\"))","v":0},{"$f":"IF(SalOnly=0,SUBTOTAL(9,AH16:AH515),IF(SalOnly=SUBTOTAL(9,$AI$16:$AI$515),SUBTOTAL(9,$AH$16:$AH$515),\"N/A\"))","v":0},{"$f":"IF(SalOnly=0,SUBTOTAL(9,AI16:AI515),IF(SalOnly=SUBTOTAL(9,$AI$16:$AI$515),SUBTOTAL(9,$AI$16:$AI$515),\"N/A\"))","v":0},{"$f":"SUBTOTAL(9,AJ16:AJ515)","v":0},0,0,0,0,0,0,0,0,0,0,0,0,0,0,0,0,0,0,0,0,0,0,0,0,0]
["Ref.\n#","Act.\n#","Act.","Exp.\ncat.","Cat.","Description","Annual salary / Cost per unit","Ben.\nrate","Salary\n& ben.","Q1\n(units)","Q2\n(units)","Q3\n(units)","Q4\n(units)","YR1\n(units)","Q5\n(units)","Q6\n(units)","Q7\n(units)","Q8\n(units)","YR2\n(units)","Q9\n(units)","Q10\n(units)","Q11\n(units)","Q12\n(units)","YR3\n(units)","Q13\n(units)","Q14\n(units)","Q15\n(units)","Q16\n(units)","YR4\n(units)","Q17\n(units)","Q18\n(units)","Q19\n(units)","Q20\n(units)","YR5\n(units)","TOTAL\n(FTEs / units)","Q1\n($)","Q2\n($)","Q3\n($)","Q4\n($)","YR1\n($)","Q5\n($)","Q6\n($)","Q7\n($)","Q8\n($)","YR2\n($)","Q9\n($)","Q10\n($)","Q11\n($)","Q12\n($)","YR3\n($)","Q13\n($)","Q14\n($)","Q15\n($)","Q16\n($)","YR4\n($)","Q17\n($)","Q18\n($)","Q19\n($)","Q20\n($)","YR5\n($)","TOTAL\n($)","Ref2.","Act2.","Cat2.","Description2","Justification","Source of funds","Organization\nincurring cost","Location / S&T\nInnovation Centre","Source / Nature of funds","Filter\nfield","Filter\nfield"]
{"$rows_left_out":501}
{"sheet":"Sum by Act","index":5,"n_rows":120,"n_cols":9,"rows_kept":120,"cut":false,"hidden":false,"merged":[[110,1,110,9],[111,1,111,9],[112,1,112,9],[109,1,109,9],[2,1,2,9],[3,1,3,9],[4,1,4,9],[5,1,5,9]]}
["Budget Summary by Activity"]
[]
["Genome Centre",{"$f":"'Primary Information'!D8","v":0}]
["Type",{"$f":"'Primary Information'!D9","v":"Research Project"}]
["Project Leader(s)",{"$f":"'Primary Information'!D10","v":"Leader Name"}]
["Project Title",{"$f":"'Primary Information'!D11","v":"Project Title"}]
[]
[]
["Below is a breakdown by Activity and Expense category.  Please scroll down further for a breakdown by Activity and Source of funds. "]
[]
[]
[]
[null,"Q1 ($)","Q2 ($)","Q3 ($)","Q4 ($)","YR1 ($)","YR2 ($)","YR3 ($)","TOTAL ($)"]
["Grand Total"]
[]
{"$rows_left_out":106}
{"sheet":"Sum by Cat","index":6,"n_rows":121,"n_cols":9,"rows_kept":121,"cut":false,"hidden":false,"merged":[[110,1,110,9],[111,1,111,9],[112,1,112,9],[2,1,2,9],[3,1,3,9],[4,1,4,9],[5,1,5,9],[109,1,109,9]]}
["Budget Summary by Category"]
[]
["Genome Centre",{"$f":"'Primary Information'!D8","v":0}]
["Type",{"$f":"'Primary Information'!D9","v":"Research Project"}]
["Project Leader(s)",{"$f":"'Primary Information'!D10","v":"Leader Name"}]
["Project Title",{"$f":"'Primary Information'!D11","v":"Project Title"}]
[]
[]
["Below is a breakdown by Expense category and Activity.  Please scroll down further for a breakdown by Expense category and Source of funds. "]
[]
[]
[]
[null,"Q1 ($)","Q2 ($)","Q3 ($)","Q4 ($)","YR1 ($)","YR2 ($)","YR3 ($)","TOTAL ($)"]
[]
[]
{"$rows_left_out":107}
{"sheet":"Qtr Breakdown","index":7,"n_rows":112,"n_cols":14,"rows_kept":112,"cut":false,"hidden":false,"merged":[[101,1,101,17],[101,18,104,20],[102,1,102,17],[103,1,103,16],[104,1,104,16],[65,1,65,17],[65,18,68,20],[66,1,66,17],[67,1,67,16],[68,1,68,16],[2,18,5,20],[2,1,2,17],[3,1,3,17],[4,1,4,16],[5,1,5,16]]}
["Quarterly Breakdown"]
[]
["Genome Centre",{"$f":"'Primary Information'!D8","v":0}]
["Type",{"$f":"'Primary Information'!D9","v":"Research Project"}]
["Project Leader(s)",{"$f":"'Primary Information'!D10","v":"Leader Name"}]
["Project Title",{"$f":"'Primary Information'!D11","v":"Project Title"}]
[]
[]
["Below is quarterly breakdown by Activity and Expense category.  Please scroll down further for a summary by Expense category and a summary by Source of funds."]
[]
[]
[]
[null,"Q1 ($)","Q2 ($)","Q3 ($)","Q4 ($)","Q5 ($)","Q6 ($)","Q7 ($)","Q8 ($)","Q9 ($)","Q10 ($)","Q11 ($)","Q12 ($)","TOTAL ($)"]
["Grand Total"]
[]
{"$rows_left_out":98}
{"sheet":"Custom Report","index":8,"n_rows":6,"n_cols":2,"rows_kept":6,"cut":false,"hidden":false,"merged":[[2,1,2,9],[3,1,3,9],[4,1,4,9],[5,1,5,9]]}
["Custom Report"]
[]
["Genome Centre",{"$f":"'Primary Information'!D8","v":0}]
["Type",{"$f":"'Primary Information'!D9","v":"Research Project"}]
["Project Leader(s)",{"$f":"'Primary Information'!D10","v":"Leader Name"}]
["Project Title",{"$f":"'Primary Information'!D11","v":"Project Title"}]

{"sheet":"Validation Lists","index":9,"n_rows":137,"n_cols":5,"rows_kept":137,"cut":false,"hidden":true,"merged":[]}
["Validation Lists"]
[]
["This tab should be hidden and locked."]
[]
["CATEGORIES","SAL","1 - Salaries"]
[null,"CONS","2 - Consumables"]
[null,"S&T","3 - Services from Others"]
[null,"G&A","4 - General & administrative"]
[null,"EQP","5 - Equipment"]
[null,"INTL","6 - International expenses"]
[]
["SAL","Administrative Staff"]
[null,"Bioinformatician"]
[null,"Biostatistician"]
[null,"Clinician (Counsellor)"]
{"$rows_left_out":122}